Package Details: jdk7-openjdk-infinality 7.u151_2.6.11-1

Git Clone URL: https://aur.archlinux.org/java7-openjdk.git (read-only)
Package Base: java7-openjdk
Description: OpenJDK Java 7 development kit
Upstream URL: http://icedtea.classpath.org
Keywords: infinality java jdk jre
Licenses: custom
Conflicts: jdk7-openjdk
Provides: java-environment=7, java-environment-openjdk=7, jdk7-openjdk=7.u151_2.6.11-1
Replaces: jdk7-openjdk-wm, openjdk6
Submitter: trollixx
Maintainer: trollixx
Last Packager: trollixx
Votes: 28
Popularity: 0.000043
First Submitted: 2014-07-22 00:55
Last Updated: 2017-09-23 19:45

Required by (693)

Sources (11)

Latest Comments

timofonic commented on 2017-09-13 14:44

Package fails to build...

https://nopaste.linux-dev.org/?1161601

zerophase commented on 2016-08-24 22:28

Getting errors when attempting to install. I have fontconfig-finality-ultimate installed.

/tmp/yaourt-tmp-zerophase/aur-jre7-openjdk-infinality/src/icedtea-2.6.6/openjdk/hotspot/src/share/vm/oops/cpCacheOop.hpp:190:42: error: left operand of shift expression ‘(-1 << 28)’ is negative [-fpermissive]
option_bits_mask = ~(((-1) << tos_state_shift) | (field_index_mask | parameter_size_mask))
~~~~~~^~~~~~~~~~~~~~~~~~~
/tmp/yaourt-tmp-zerophase/aur-jre7-openjdk-infinality/src/icedtea-2.6.6/openjdk/hotspot/src/share/vm/oops/cpCacheOop.hpp:190:104: error: enumerator value for ‘option_bits_mask’ is not an integer constant
option_bits_mask = ~(((-1) << tos_state_shift) | (field_index_mask | parameter_size_mask))
^
In file included from /tmp/yaourt-tmp-zerophase/aur-jre7-openjdk-infinality/src/icedtea-2.6.6/openjdk/hotspot/src/share/vm/ci/ciEnv.hpp:32:0,
from /tmp/yaourt-tmp-zerophase/aur-jre7-openjdk-infinality/src/icedtea-2.6.6/openjdk/hotspot/src/share/vm/ci/ciUtilities.hpp:28,
from /tmp/yaourt-tmp-zerophase/aur-jre7-openjdk-infinality/src/icedtea-2.6.6/openjdk/hotspot/src/share/vm/ci/ciNullObject.hpp:30,
from /tmp/yaourt-tmp-zerophase/aur-jre7-openjdk-infinality/src/icedtea-2.6.6/openjdk/hotspot/src/share/vm/ci/ciConstant.hpp:29,
from /tmp/yaourt-tmp-zerophase/aur-jre7-openjdk-infinality/src/icedtea-2.6.6/openjdk/hotspot/src/share/vm/precompiled/precompiled.hpp:36:
/tmp/yaourt-tmp-zerophase/aur-jre7-openjdk-infinality/src/icedtea-2.6.6/openjdk/hotspot/src/share/vm/code/dependencies.hpp:169:59: error: left operand of shift expression ‘(-1 << 1)’ is negative [-fpermissive]
all_types = ((1 << TYPE_LIMIT) - 1) & ((-1) << FIRST_TYPE),
~~~~~~^~~~~~~~~~~~~~
/tmp/yaourt-tmp-zerophase/aur-jre7-openjdk-infinality/src/icedtea-2.6.6/openjdk/hotspot/src/share/vm/code/dependencies.hpp:169:72: error: enumerator value for ‘all_types’ is not an integer constant
all_types = ((1 << TYPE_LIMIT) - 1) & ((-1) << FIRST_TYPE),
^
make[7]: *** [/tmp/yaourt-tmp-zerophase/aur-jre7-openjdk-infinality/src/icedtea-2.6.6/openjdk/hotspot/make/linux/makefiles/vm.make:331: precompiled.hpp.gch] Error 1
make[7]: Leaving directory '/tmp/yaourt-tmp-zerophase/aur-jre7-openjdk-infinality/src/icedtea-2.6.6/openjdk.build/hotspot/outputdir/linux_amd64_compiler2/product'
make[6]: *** [/tmp/yaourt-tmp-zerophase/aur-jre7-openjdk-infinality/src/icedtea-2.6.6/openjdk/hotspot/make/linux/makefiles/top.make:119: the_vm] Error 2
make[6]: Leaving directory '/tmp/yaourt-tmp-zerophase/aur-jre7-openjdk-infinality/src/icedtea-2.6.6/openjdk.build/hotspot/outputdir/linux_amd64_compiler2/product'
make[5]: *** [/tmp/yaourt-tmp-zerophase/aur-jre7-openjdk-infinality/src/icedtea-2.6.6/openjdk/hotspot/make/linux/Makefile:336: product] Error 2
make[5]: Leaving directory '/tmp/yaourt-tmp-zerophase/aur-jre7-openjdk-infinality/src/icedtea-2.6.6/openjdk.build/hotspot/outputdir'
make[4]: *** [Makefile:203: generic_build2] Error 2
make[4]: Leaving directory '/tmp/yaourt-tmp-zerophase/aur-jre7-openjdk-infinality/src/icedtea-2.6.6/openjdk/hotspot/make'
make[3]: *** [Makefile:158: product] Error 2
make[3]: Leaving directory '/tmp/yaourt-tmp-zerophase/aur-jre7-openjdk-infinality/src/icedtea-2.6.6/openjdk/hotspot/make'
make[2]: *** [make/hotspot-rules.gmk:128: hotspot-build] Error 2
make[2]: Leaving directory '/tmp/yaourt-tmp-zerophase/aur-jre7-openjdk-infinality/src/icedtea-2.6.6/openjdk'
make[1]: *** [Makefile:251: build_product_image] Error 2
make[1]: Leaving directory '/tmp/yaourt-tmp-zerophase/aur-jre7-openjdk-infinality/src/icedtea-2.6.6/openjdk'

Arthur2e5 commented on 2016-04-21 04:13

'fontconfig' should be included in depends.

rbellamy commented on 2015-11-09 02:05

I'm having issues running makepkg. I'm betting I'm doing something stupid, but here you go anyway with a sample of the compile errors I'm seeing:

[javac] warning: /usr/lib/jvm/java-8-openjdk/jre/lib/rt.jar(java/util/logging/Logger.class): major version 52 is newer than 51, the highest major version supported by this compiler.
[javac] It is recommended that the compiler be upgraded.
[javac] /tmp/pkgbuild-1000/jre7-openjdk-infinality/src/icedtea-2.6.2/openjdk/jaxws/src/share/jaxws_classes/com/sun/istack/internal/tools/APTTypeVisitor.java:28: error: package com.sun.mirror.type does not exist
[javac] import com.sun.mirror.type.TypeMirror;

Yes I just recompiled Ant.

2015-11-08 18:03:23
rbellamy@eanna i ~ % archlinux-java status
Available Java environments:
java-6-jdk
java-7-jdk
java-7-openjdk
java-8-jdk
java-8-openjdk (default)

I've also tried setting the JAVA_HOME environment explicitly just before building, to point to one of my other JDKs. But then the build process seems to go out and find my java-8-openjdk path and use it anyway.

pftBest commented on 2015-11-06 07:44

Please update the package to 7.u91_2.6.2
This version has a bug, see https://bugs.archlinux.org/task/45824

TheAifam5 commented on 2015-10-07 11:33

loading packages...
resolving dependencies...
warning: cannot resolve "jre7-openjdk-infinality=7.u85_2.6.1-1", a dependency of "jdk7-openjdk-infinality"
:: The following package cannot be upgraded due to unresolvable dependencies:
jdk7-openjdk-infinality

:(

Ringdingcoder commented on 2015-05-06 19:20

I'm seeing the same thing with my build on Fedora. Looks like the changeset referenced in http://bugs.java.com/view_bug.do?bug_id=8048214 should take care of that.

trollixx commented on 2015-04-28 08:08

@pschyma unfortunately, I have no idea why it fails for you. Check for any other errors reported in the log, maybe something failed before.

pschyma commented on 2015-04-28 06:57

The current build fails with a linkage error:

Linking vm...
echo Linking launcher...
Linking launcher...
cc -m64 -Xlinker -O1 -Wl,--hash-style=both -Xlinker -z -Xlinker noexecstack -m64 -Xlinker -export-dynamic -L `pwd` -o gamma launcher/java_md.o launcher/wildcard.o launcher/jli_util.o launcher/java.o -ljvm -lm -ldl -lpthread
/tmp/yaourt-tmp-peter/aur-jre7-openjdk-infinality/src/icedtea-2.5.5/openjdk.build/hotspot/outputdir/linux_amd64_compiler2/product/libjvm.so: undefined reference to `void G1SATBCardTableModRefBS::write_ref_array_pre_work<oopDesc*>(oopDesc**, int)'
collect2: error: ld returned 1 exit status
/tmp/yaourt-tmp-peter/aur-jre7-openjdk-infinality/src/icedtea-2.5.5/openjdk/hotspot/make/linux/makefiles/launcher.make:83: recipe for target 'gamma' failed
make[7]: *** [gamma] Error 1
make[7]: Leaving directory '/tmp/yaourt-tmp-peter/aur-jre7-openjdk-infinality/src/icedtea-2.5.5/openjdk.build/hotspot/outputdir/linux_amd64_compiler2/product'
/tmp/yaourt-tmp-peter/aur-jre7-openjdk-infinality/src/icedtea-2.5.5/openjdk/hotspot/make/linux/makefiles/top.make:119: recipe for target 'the_vm' failed
make[6]: *** [the_vm] Error 2
make[6]: Leaving directory '/tmp/yaourt-tmp-peter/aur-jre7-openjdk-infinality/src/icedtea-2.5.5/openjdk.build/hotspot/outputdir/linux_amd64_compiler2/product'
/tmp/yaourt-tmp-peter/aur-jre7-openjdk-infinality/src/icedtea-2.5.5/openjdk/hotspot/make/linux/Makefile:310: recipe for target 'product' failed
make[5]: *** [product] Error 2
make[5]: Leaving directory '/tmp/yaourt-tmp-peter/aur-jre7-openjdk-infinality/src/icedtea-2.5.5/openjdk.build/hotspot/outputdir'
Makefile:202: recipe for target 'generic_build2' failed
make[4]: *** [generic_build2] Error 2
make[4]: Leaving directory '/tmp/yaourt-tmp-peter/aur-jre7-openjdk-infinality/src/icedtea-2.5.5/openjdk/hotspot/make'
Makefile:158: recipe for target 'product' failed
make[3]: *** [product] Error 2
make[3]: Leaving directory '/tmp/yaourt-tmp-peter/aur-jre7-openjdk-infinality/src/icedtea-2.5.5/openjdk/hotspot/make'
make/hotspot-rules.gmk:125: recipe for target 'hotspot-build' failed
make[2]: *** [hotspot-build] Error 2

cjr commented on 2015-03-28 12:48

Some people may have problems building this package, because of not having enough memory. If the build of the package fails, raise the size of your /tmp mount to at least 4 GB.

All comments